Target
Farnesyl pyrophosphate synthase
Ligand
BDBM25290
Substrate
Meas. Tech.
ChEMBL_194806 (CHEMBL799889)
IC50
1.0±n/a nM
Citation
 Kotsikorou, EOldfield, E A quantitative structure-activity relationship and pharmacophore modeling investigation of aryl-X and heterocyclic bisphosphonates as bone resorption agents. J Med Chem 46:2932-44 (2003)  
Target
Name:
Farnesyl pyrophosphate synthase
Synonyms:
Dimethylallyltranstransferase FPP synthase FPPS_HUMAN Farnesyl diphosphate synthase Farnesyl diphosphate synthetase Farnesyl pyrophosphate synthetase KIAA1293 | P14324
Type:
Enzyme
Mol. Mass.:
48272.89
Organism:
Homo sapiens (Human)
Description:
P14324
Residue:
419
  
Inhibitor
Name:
BDBM25290
Synonyms:
CHEMBL56073 {1-hydroxy-3-[methyl(4-phenylbutyl)amino]-1-phosphonopropyl}phosphonic acid
Type:
Small organic molecule
Emp. Form.:
C14H25NO7P2
Mol. Mass.:
381.2983
SMILES:
CN(CCCCc1ccccc1)CCC(O)(P(O)(O)=O)P(O)(O)=O
: