Target
Farnesyl pyrophosphate synthase
Ligand
BDBM50117257
Substrate
Meas. Tech.
ChEMBL_194806 (CHEMBL799889)
IC50
2.6±n/a nM
Citation
 Kotsikorou, EOldfield, E A quantitative structure-activity relationship and pharmacophore modeling investigation of aryl-X and heterocyclic bisphosphonates as bone resorption agents. J Med Chem 46:2932-44 (2003)  
Target
Name:
Farnesyl pyrophosphate synthase
Synonyms:
Dimethylallyltranstransferase FPP synthase FPPS_HUMAN Farnesyl diphosphate synthase Farnesyl diphosphate synthetase Farnesyl pyrophosphate synthetase KIAA1293 | P14324
Type:
Enzyme
Mol. Mass.:
48272.89
Organism:
Homo sapiens (Human)
Description:
P14324
Residue:
419
  
Inhibitor
Name:
BDBM50117257
Synonyms:
1-hydroxy-3-(methyl(3-phenylpropyl)amino)propane-1,1-diyldiphosphonic acid {1-Hydroxy-3-[methyl-(3-phenyl-propyl)-amino]-1-phosphono-propyl}-phosphonic acid
Type:
Small organic molecule
Emp. Form.:
C13H23NO7P2
Mol. Mass.:
367.2717
SMILES:
CN(CCCc1ccccc1)CCC(O)(P(O)(O)=O)P(O)(O)=O
: