Target
Amine oxidase [flavin-containing] B
Ligand
BDBM50422881
Substrate
Meas. Tech.
ChEMBL_381433 (CHEMBL867938)
IC50
5.1±n/a nM
Citation
 Catto, MNicolotti, OLeonetti, FCarotti, AFavia, ADSoto-Otero, RMéndez-Alvarez, ECarotti, A Structural insights into monoamine oxidase inhibitory potency and selectivity of 7-substituted coumarins from ligand- and target-based approaches. J Med Chem 49:4912-25 (2006)  
Target
Name:
Amine oxidase [flavin-containing] B
Synonyms:
AOFB_RAT Amine oxidase [flavin-containing] B Monoamine Oxidase Type B (MAO-B) Monoamine oxidase B (MAO-B) Monoamine oxidase type B (MAOB) | Monoamine oxidase-B (MAO-B)
Type:
Enzyme
Mol. Mass.:
58469.65
Organism:
Rattus norvegicus (rat)
Description:
P19643
Residue:
520
  
Inhibitor
Name:
BDBM50422881
Synonyms:
CHEMBL213955
Type:
Small organic molecule
Emp. Form.:
C17H13ClO3
Mol. Mass.:
300.736
SMILES:
Cc1cc2ccc(OCc3cccc(Cl)c3)cc2oc1=O
: