Target
Peroxisome proliferator-activated receptor gamma
Ligand
BDBM50002864
Substrate
Meas. Tech.
ChEMBL_438960 (CHEMBL889304)
Ki
51±n/a nM
Citation
 Trump, RPCobb, JEShearer, BGLambert, MHNolte, RTWillson, TMBuckholz, RGZhao, SMLeesnitzer, LMIannone, MAPearce, KHBillin, ANHoekstra, WJ Co-crystal structure guided array synthesis of PPARgamma inverse agonists. Bioorg Med Chem Lett 17:3916-20 (2007)  
Target
Name:
Peroxisome proliferator-activated receptor gamma
Synonyms:
NR1C3 PPAR-gamma PPARG_HUMAN Peroxisome proliferator-activated receptor gamma (PPAR gamma) Peroxisome proliferator-activated receptor gamma (PPARĪ³) peroxisome proliferator-activated receptor gamma isoform 2
Type:
Nuclear Receptor
Mol. Mass.:
57613.46
Organism:
Homo sapiens (Human)
Description:
P37231
Residue:
505
  
Inhibitor
Name:
BDBM50002864
Synonyms:
CHEMBL398183
Type:
Small organic molecule
Emp. Form.:
C40H42N4O4
Mol. Mass.:
642.7859
SMILES:
Cc1oc(nc1CCOc1ccc(C[C@@H](CNC(=O)C2CCCNC2)Nc2ccccc2C(=O)c2ccccc2)cc1)-c1ccccc1
: