Target
Stromelysin-1
Ligand
BDBM13090
Substrate
Meas. Tech.
ChEMBL_458936 (CHEMBL924955)
Ki
63±n/a nM
Citation
 Verma, RPHansch, C Matrix metalloproteinases (MMPs): chemical-biological functions and (Q)SARs. Bioorg Med Chem 15:2223-68 (2007)  
Target
Name:
Stromelysin-1
Synonyms:
MMP-3 MMP3_HUMAN Matrix metalloproteinase 3 Matrix metalloproteinase-3 (MMP-3) SL-1 Stromelysin 1 | Transin-1
Type:
Enzyme
Mol. Mass.:
53973.13
Organism:
Homo sapiens (Human)
Description:
P08254
Residue:
477
  
Inhibitor
Name:
BDBM13090
Synonyms:
2-{[4-(hexyloxy)benzene](2-methylpropyl)sulfonamido}-N-hydroxyacetamide | CGS 27023A Analog 18
Type:
Small organic molecule
Emp. Form.:
C18H30N2O5S
Mol. Mass.:
386.506
SMILES:
CCCCCCOc1ccc(cc1)S(=O)(=O)N(CC(C)C)CC(=O)NO
: