Target
Neutrophil collagenase
Ligand
BDBM50081866
Substrate
Meas. Tech.
ChEMBL_458937 (CHEMBL924956)
IC50
3.0±n/a nM
Citation
 Verma, RPHansch, C Matrix metalloproteinases (MMPs): chemical-biological functions and (Q)SARs. Bioorg Med Chem 15:2223-68 (2007)  
Target
Name:
Neutrophil collagenase
Synonyms:
CLG1 MMP8 Matrix metalloproteinase-8 PMNL collagenase | PMNL-CL
Type:
Enzyme
Mol. Mass.:
53413.48
Organism:
Homo sapiens (Human)
Description:
P22894
Residue:
467
  
Inhibitor
Name:
BDBM50081866
Synonyms:
(2R,3R)-3-(cyclopentylmethyl)-N-hydroxy-2-((4-methoxy-N-methylphenylsulfonamido)methyl)-4-morpholino-4-oxobutanamide CHEMBL329298
Type:
Small organic molecule
Emp. Form.:
C23H35N3O7S
Mol. Mass.:
497.605
SMILES:
COc1ccc(cc1)S(=O)(=O)N(C)C[C@@H]([C@@H](CC1CCCC1)C(=O)N1CCOCC1)C(=O)NO
: