Target
Cyclin-T1/Cyclin-dependent kinase 9
Ligand
BDBM50423753
Substrate
Meas. Tech.
ChEMBL_612601 (CHEMBL1064251)
Ki
2.0±n/a nM
Citation
 McIntyre, NAMcInnes, CGriffiths, GBarnett, ALKontopidis, GSlawin, AMJackson, WThomas, MZheleva, DIWang, SBlake, DGWestwood, NJFischer, PM Design, synthesis, and evaluation of 2-methyl- and 2-amino-N-aryl-4,5-dihydrothiazolo[4,5-h]quinazolin-8-amines as ring-constrained 2-anilino-4-(thiazol-5-yl)pyrimidine cyclin-dependent kinase inhibitors. J Med Chem 53:2136-45 (2010)  
Target
Name:
Cyclin-T1/Cyclin-dependent kinase 9
Synonyms:
CDK9/ Cyclin-T1 CDK9/Cyclin T Cyclin T1/dependent kinase 9 | Cyclin-Dependent Kinase 9 (CDK9)
Type:
Protein Complex
Mol. Mass.:
Description:
Components:
This complex has 2 components.
Component 1
Name:
Cyclin-T1
Synonyms:
CCNT1 CycT Cyclin T Cyclin-T
Type:
Enzyme Subunit
Mol. Mass.:
80712.40
Organism:
Homo sapiens (Human)
Description:
Residue:
726
  
Component 2
Name:
Cyclin-dependent kinase 9
Synonyms:
C-2K CDK9 Cell division cycle 2-like protein kinase 4 Cyclin-Dependent Kinase 9 (CDK9) Serine/threonine-protein kinase PITALRE Tat-associated kinase complex catalytic subunit
Type:
Enzyme Subunit
Mol. Mass.:
42789.13
Organism:
Homo sapiens (Human)
Description:
Residue:
372
  
Inhibitor
Name:
BDBM50423753
Synonyms:
CHEMBL601064
Type:
Small organic molecule
Emp. Form.:
C16H13N5O2S
Mol. Mass.:
339.372
SMILES:
Cc1nc2CCc3cnc(Nc4cccc(c4)[N+]([O-])=O)nc3-c2s1
: