Target
Dynamin-2
Ligand
BDBM50423883
Substrate
Meas. Tech.
ChEMBL_934669 (CHEMBL2318139)
IC50
5400±n/a nM
Citation
 Gordon, CPVenn-Brown, BRobertson, MJYoung, KAChau, NMariana, AWhiting, AChircop, MRobinson, PJMcCluskey, A Development of second-generation indole-based dynamin GTPase inhibitors. J Med Chem 56:46-59 (2013)  
Target
Name:
Dynamin-2
Synonyms:
DYN2_RAT Dyn2
Type:
PROTEIN
Mol. Mass.:
98236.76
Organism:
Rattus norvegicus
Description:
ChEMBL_1458574
Residue:
870
  
Inhibitor
Name:
BDBM50423883
Synonyms:
CHEMBL2312430
Type:
Small organic molecule
Emp. Form.:
C24H41N3
Mol. Mass.:
371.6024
SMILES:
CCCCCCCCCCNCc1cn(CCCN(C)C)c2ccccc12
: