Target
Dynamin-2
Ligand
BDBM50423885
Substrate
Meas. Tech.
ChEMBL_934670 (CHEMBL2318140)
IC50
2800±n/a nM
Citation
 Gordon, CPVenn-Brown, BRobertson, MJYoung, KAChau, NMariana, AWhiting, AChircop, MRobinson, PJMcCluskey, A Development of second-generation indole-based dynamin GTPase inhibitors. J Med Chem 56:46-59 (2013)  
Target
Name:
Dynamin-2
Synonyms:
DNM2 DYN2_HUMAN
Type:
PROTEIN
Mol. Mass.:
98071.19
Organism:
Homo sapiens (Human)
Description:
ChEMBL_934670
Residue:
870
  
Inhibitor
Name:
BDBM50423885
Synonyms:
CHEMBL2312431
Type:
Small organic molecule
Emp. Form.:
C26H45N3
Mol. Mass.:
399.6556
SMILES:
CCCCCCCCCCCCNCc1cn(CCCN(C)C)c2ccccc12
: