Target
Dynamin-2
Ligand
BDBM50423883
Substrate
Meas. Tech.
ChEMBL_934670 (CHEMBL2318140)
IC50
1900±n/a nM
Citation
 Gordon, CPVenn-Brown, BRobertson, MJYoung, KAChau, NMariana, AWhiting, AChircop, MRobinson, PJMcCluskey, A Development of second-generation indole-based dynamin GTPase inhibitors. J Med Chem 56:46-59 (2013)  
Target
Name:
Dynamin-2
Synonyms:
DNM2 DYN2_HUMAN
Type:
PROTEIN
Mol. Mass.:
98071.19
Organism:
Homo sapiens (Human)
Description:
ChEMBL_934670
Residue:
870
  
Inhibitor
Name:
BDBM50423883
Synonyms:
CHEMBL2312430
Type:
Small organic molecule
Emp. Form.:
C24H41N3
Mol. Mass.:
371.6024
SMILES:
CCCCCCCCCCNCc1cn(CCCN(C)C)c2ccccc12
: