Target
Muscarinic acetylcholine receptor M5
Ligand
BDBM50424122
Substrate
Meas. Tech.
ChEMBL_937326 (CHEMBL2319089)
IC50
>10000±n/a nM
Citation
 Sheffler, DJSevel, CLe, ULovell, KMTarr, JCCarrington, SJCho, HPDigby, GJNiswender, CMConn, PJHopkins, CRWood, MRLindsley, CW Further exploration of M1 allosteric agonists: subtle structural changes abolish M1 allosteric agonism and result in pan-mAChR orthosteric antagonism. Bioorg Med Chem Lett 23:223-7 (2012)  
Target
Name:
Muscarinic acetylcholine receptor M5
Synonyms:
ACM5_RAT Chrm-5 Muscarinic acetylcholine receptor | Muscarinic acetylcholine receptor M5
Type:
Enzyme Catalytic Domain
Mol. Mass.:
60161.80
Organism:
RAT
Description:
Cholinergic, muscarinic M5 CHRM5 RAT::P08911
Residue:
531
  
Inhibitor
Name:
BDBM50424122
Synonyms:
CHEMBL2315676
Type:
Small organic molecule
Emp. Form.:
C27H34N4O
Mol. Mass.:
430.5851
SMILES:
Cc1ccccc1CN1CCC(CC1)N1CC2CC(CC2C1)n1c2ccccc2[nH]c1=O
: