Target
Histone deacetylase 1
Ligand
BDBM50424194
Substrate
Meas. Tech.
ChEMBL_933603 (CHEMBL2319987)
IC50
97±n/a nM
Citation
 Li, YZhou, YQian, PWang, YJiang, FYao, ZHu, WZhao, YLi, S Design, synthesis and bioevalution of novel benzamides derivatives as HDAC inhibitors. Bioorg Med Chem Lett 23:179-82 (2012)  
Target
Name:
Histone deacetylase 1
Synonyms:
Cereblon/Histone deacetylase 1 HDAC1 Histone deacetylase 1 (HDAC1) RPD3L1
Type:
Enzyme
Mol. Mass.:
55090.27
Organism:
Homo sapiens (Human)
Description:
Q13547
Residue:
482
  
Inhibitor
Name:
BDBM50424194
Synonyms:
CHEMBL2312462
Type:
Small organic molecule
Emp. Form.:
C26H22FN7O
Mol. Mass.:
467.4976
SMILES:
Cc1nc2ccccn2c1-c1ccnc(NCc2ccc(cc2)C(=O)Nc2cc(F)ccc2N)n1
: