Target
Multidrug and toxin extrusion protein 1
Ligand
BDBM50128267
Substrate
Meas. Tech.
ChEMBL_934320 (CHEMBL2320306)
IC50
7900±n/a nM
Citation
 Wittwer, MBZur, AAKhuri, NKido, YKosaka, AZhang, XMorrissey, KMSali, AHuang, YGiacomini, KM Discovery of potent, selective multidrug and toxin extrusion transporter 1 (MATE1, SLC47A1) inhibitors through prescription drug profiling and computational modeling. J Med Chem 56:781-95 (2013)  
Target
Name:
Multidrug and toxin extrusion protein 1
Synonyms:
MATE-1 S47A1_HUMAN Solute carrier family 47 member 1 | hMATE-1
Type:
PROTEIN
Mol. Mass.:
61928.01
Organism:
Homo sapiens (Human)
Description:
ChEMBL_934313
Residue:
570
  
Inhibitor
Name:
BDBM50128267
Synonyms:
(4S)-4,11-DIETHYL-4-HYDROXY-3,14-DIOXO-3,4,12,14-TETRAHYDRO-1H-PYRANO[3',4':6,7]INDOLIZINO[1,2-B]QUINOLIN-9-YL 1,4'-BIPIPERIDINE-1'-CARBOXYLATE Camptosar [1,4']Bipiperidinyl-1'-carboxylic acid 4,11-diethyl-4-hydroxy-3,13-dioxo-3,4,12,13-tetrahydro-1H-2-oxa-6,12a-diaza-dibenzo[b,h]fluoren-9-yl ester | [1,4']bipiperidinyl-1'-carboxylic acid (S)-4,11-diethyl-4-hydroxy-3,13-dioxo-3,4,12,13-tetrahydro-1H-2-oxa-6,12a-diaza-dibenzo[b,h]fluoren-9-yl ester
Type:
Small organic molecule
Emp. Form.:
C33H38N4O6
Mol. Mass.:
586.678
SMILES:
CCc1c2Cn3c(cc4c(COC(=O)[C@]4(O)CC)c3=O)-c2nc2ccc(OC(=O)N3CCC(CC3)N3CCCCC3)cc12
: