Target
Multidrug and toxin extrusion protein 1
Ligand
BDBM50241107
Substrate
Meas. Tech.
ChEMBL_934320 (CHEMBL2320306)
IC50
2300±n/a nM
Citation
 Wittwer, MBZur, AAKhuri, NKido, YKosaka, AZhang, XMorrissey, KMSali, AHuang, YGiacomini, KM Discovery of potent, selective multidrug and toxin extrusion transporter 1 (MATE1, SLC47A1) inhibitors through prescription drug profiling and computational modeling. J Med Chem 56:781-95 (2013)  
Target
Name:
Multidrug and toxin extrusion protein 1
Synonyms:
MATE-1 S47A1_HUMAN Solute carrier family 47 member 1 | hMATE-1
Type:
PROTEIN
Mol. Mass.:
61928.01
Organism:
Homo sapiens (Human)
Description:
ChEMBL_934313
Residue:
570
  
Inhibitor
Name:
BDBM50241107
Synonyms:
1-(3-(4-(5-chloro-2-oxo-2,3-dihydrobenzo[d]imidazol-1-yl)piperidin-1-yl)propyl)-1H-benzo[d]imidazol-2(3H)-one 5-Chloro-1-{1-[3-(2-oxo-2,3-dihydro-benzoimidazol-1-yl)-propyl]-piperidin-4-yl}-1,3-dihydro-benzoimidazol-2-one(domperidone) 5-chloro-1-{1-[3-(2-oxo-2,3-dihydro-benzoimidazol-1-yl)-propyl]-piperidin-4-yl}-1,3-dihydro-benzoimidazol-2-one CHEMBL219916 DOMPERIDONE5-Chloro-1-{1-[3-(2-oxo-2,3-dihydro-benzoimidazol-1-yl)-propyl]-piperidin-4-yl}-1,3-dihydro-benzoimidazol-2-one US9132134, Domperidone
Type:
Small organic molecule
Emp. Form.:
C22H24ClN5O2
Mol. Mass.:
425.911
SMILES:
Clc1ccc2n(C3CCN(CCCn4c5ccccc5[nH]c4=O)CC3)c(=O)[nH]c2c1
: