Target
Epidermal growth factor receptor
Ligand
BDBM50424968
Substrate
Meas. Tech.
ChEMBL_934773 (CHEMBL2318907)
IC50
5600±n/a nM
Citation
 Xu, YYCao, YMa, HLi, HQAo, GZ Design, synthesis and molecular docking ofa,ß-unsaturated cyclohexanone analogous of curcumin as potent EGFR inhibitors with antiproliferative activity. Bioorg Med Chem 21:388-94 (2012)  
Target
Name:
Epidermal growth factor receptor
Synonyms:
EGF Receptor Substrate EGFR_HUMAN ERBB1 Epidermal Growth Factor Receptor erbB-1 Epidermal growth factor receptor (EGFR) HER1 Proto-oncogene c-ErbB-1 Tyrosine-Protein Kinase ErbB-1
Type:
Receptor Kinase Domain
Mol. Mass.:
134279.59
Organism:
Homo sapiens (Human)
Description:
P00533
Residue:
1210
  
Inhibitor
Name:
BDBM50424968
Synonyms:
CHEMBL2316147 | US9409845, Table 1, Compound 8: (2E,6E)-2-(3,5-dimethoxybenzylidene)-6-(4-fluorobenzylidene)cyclohexanone
Type:
Small organic molecule
Emp. Form.:
C22H21FO3
Mol. Mass.:
352.3987
SMILES:
COc1cc(OC)cc(\C=C2/CCC\C(=C/c3ccc(F)cc3)C2=O)c1
: