Target
Histone deacetylase 11
Ligand
BDBM50424998
Substrate
Meas. Tech.
ChEMBL_936026 (CHEMBL2318992)
IC50
2135±n/a nM
Citation
 Marek, LHamacher, AHansen, FKKuna, KGohlke, HKassack, MUKurz, T Histone deacetylase (HDAC) inhibitors with a novel connecting unit linker region reveal a selectivity profile for HDAC4 and HDAC5 with improved activity against chemoresistant cancer cells. J Med Chem 56:427-36 (2013)  
Target
Name:
Histone deacetylase 11
Synonyms:
HD11 HDAC11 | Human HDAC11
Type:
Chromatin regulator; hydrolase; repressor
Mol. Mass.:
39187.66
Organism:
Homo sapiens (Human)
Description:
Q96DB2
Residue:
347
  
Inhibitor
Name:
BDBM50424998
Synonyms:
CHEMBL2312164
Type:
Small organic molecule
Emp. Form.:
C14H20N2O4
Mol. Mass.:
280.3196
SMILES:
Cc1cccc(c1)C(=O)NOCCCCCC(=O)NO
: