Target
Histone deacetylase 5
Ligand
BDBM50424998
Substrate
Meas. Tech.
ChEMBL_936029 (CHEMBL2318995)
IC50
2.3±n/a nM
Citation
 Marek, LHamacher, AHansen, FKKuna, KGohlke, HKassack, MUKurz, T Histone deacetylase (HDAC) inhibitors with a novel connecting unit linker region reveal a selectivity profile for HDAC4 and HDAC5 with improved activity against chemoresistant cancer cells. J Med Chem 56:427-36 (2013)  
Target
Name:
Histone deacetylase 5
Synonyms:
Antigen NY-CO-9 HDAC5 Histone acetylase 5 (HDAC5) Human HDAC5 | KIAA0600
Type:
Enzyme
Mol. Mass.:
121968.61
Organism:
Homo sapiens (Human)
Description:
Q9UQL6
Residue:
1122
  
Inhibitor
Name:
BDBM50424998
Synonyms:
CHEMBL2312164
Type:
Small organic molecule
Emp. Form.:
C14H20N2O4
Mol. Mass.:
280.3196
SMILES:
Cc1cccc(c1)C(=O)NOCCCCCC(=O)NO
: