Target
Histone deacetylase 4
Ligand
BDBM50424998
Substrate
Meas. Tech.
ChEMBL_936030 (CHEMBL2318996)
IC50
16±n/a nM
Citation
 Marek, LHamacher, AHansen, FKKuna, KGohlke, HKassack, MUKurz, T Histone deacetylase (HDAC) inhibitors with a novel connecting unit linker region reveal a selectivity profile for HDAC4 and HDAC5 with improved activity against chemoresistant cancer cells. J Med Chem 56:427-36 (2013)  
Target
Name:
Histone deacetylase 4
Synonyms:
Cereblon/Histone deacetylase 4 HDAC4 Histone acetylase 4(HDAC4) KIAA0288
Type:
Enzyme
Mol. Mass.:
119049.39
Organism:
Homo sapiens (Human)
Description:
P56524
Residue:
1084
  
Inhibitor
Name:
BDBM50424998
Synonyms:
CHEMBL2312164
Type:
Small organic molecule
Emp. Form.:
C14H20N2O4
Mol. Mass.:
280.3196
SMILES:
Cc1cccc(c1)C(=O)NOCCCCCC(=O)NO
: