Target
Histone deacetylase 2
Ligand
BDBM50424998
Substrate
Meas. Tech.
ChEMBL_936031 (CHEMBL2318997)
IC50
1392±n/a nM
Citation
 Marek, LHamacher, AHansen, FKKuna, KGohlke, HKassack, MUKurz, T Histone deacetylase (HDAC) inhibitors with a novel connecting unit linker region reveal a selectivity profile for HDAC4 and HDAC5 with improved activity against chemoresistant cancer cells. J Med Chem 56:427-36 (2013)  
Target
Name:
Histone deacetylase 2
Synonyms:
Cereblon/Histone deacetylase 2 HDAC2 Histone deacetylase 2 (HDAC2) | Human HDAC2
Type:
Chromatin regulator; hydrolase; repressor
Mol. Mass.:
55356.54
Organism:
Homo sapiens (Human)
Description:
Q92769
Residue:
488
  
Inhibitor
Name:
BDBM50424998
Synonyms:
CHEMBL2312164
Type:
Small organic molecule
Emp. Form.:
C14H20N2O4
Mol. Mass.:
280.3196
SMILES:
Cc1cccc(c1)C(=O)NOCCCCCC(=O)NO
: