Target
Intermediate conductance calcium-activated potassium channel protein 4
Ligand
BDBM50425093
Substrate
Meas. Tech.
ChEMBL_936631 (CHEMBL2319030)
IC50
>33000±n/a nM
Citation
 Olsson, RIJacobson, IBoström, JFex, TBjöre, AOlsson, CSundell, JGran, UÖhrn, ANordin, AGyll, JThorstensson, MHayen, AAplander, KHidestål, OJiang, FLinhardt, GForsström, ECollins, TSundqvist, MLindhardt, EÅstrand, ALöfberg, B Synthesis and evaluation of diphenylphosphinic amides and diphenylphosphine oxides as inhibitors of Kv1.5. Bioorg Med Chem Lett 23:706-10 (2013)  
Target
Name:
Intermediate conductance calcium-activated potassium channel protein 4
Synonyms:
IK1 KCA4 KCNN4_HUMAN SK4
Type:
PROTEIN
Mol. Mass.:
47723.22
Organism:
Homo sapiens (Human)
Description:
ChEMBL_1361891
Residue:
427
  
Inhibitor
Name:
BDBM50425093
Synonyms:
CHEMBL2312921
Type:
Small organic molecule
Emp. Form.:
C22H24NO3PS
Mol. Mass.:
413.47
SMILES:
CCCN(c1cccc(c1)S(C)(=O)=O)P(=O)(c1ccccc1)c1ccccc1
: