Target
Potassium voltage-gated channel subfamily A member 5
Ligand
BDBM50425105
Substrate
Meas. Tech.
ChEMBL_936633 (CHEMBL2319032)
IC50
2700±n/a nM
Citation
 Olsson, RIJacobson, IBoström, JFex, TBjöre, AOlsson, CSundell, JGran, UÖhrn, ANordin, AGyll, JThorstensson, MHayen, AAplander, KHidestål, OJiang, FLinhardt, GForsström, ECollins, TSundqvist, MLindhardt, EÅstrand, ALöfberg, B Synthesis and evaluation of diphenylphosphinic amides and diphenylphosphine oxides as inhibitors of Kv1.5. Bioorg Med Chem Lett 23:706-10 (2013)  
Target
Name:
Potassium voltage-gated channel subfamily A member 5
Synonyms:
HK2 KCNA5 Potassium voltage-gated channel subfamily A member 5 Voltage-gated potassium channel subunit Kv1.5
Type:
Enzyme
Mol. Mass.:
67222.47
Organism:
Homo sapiens (Human)
Description:
P22460
Residue:
613
  
Inhibitor
Name:
BDBM50425105
Synonyms:
CHEMBL2312932
Type:
Small organic molecule
Emp. Form.:
C23H20N3OP
Mol. Mass.:
385.3982
SMILES:
O=P(NCc1cccnc1-c1cccnc1)(c1ccccc1)c1ccccc1
: