Target
Melatonin receptor type 1A
Ligand
BDBM50425200
Substrate
Meas. Tech.
ChEMBL_937788 (CHEMBL2318042)
Ki
0.060000±n/a nM
Citation
 Morellato, LLefas-Le Gall, MLanglois, MCaignard, DHRenard, PDelagrange, PMathé-Allainmat, M Synthesis of new N-(arylcyclopropyl)acetamides and N-(arylvinyl)acetamides as conformationally-restricted ligands for melatonin receptors. Bioorg Med Chem Lett 23:430-4 (2012)  
Target
Name:
Melatonin receptor type 1A
Synonyms:
MTNR1A MTR1A_HUMAN Mel1a melatonin receptor Melatonin receptor Melatonin receptor type 1 (MT1) | Melatonin receptor type 1A
Type:
Enzyme
Mol. Mass.:
39392.94
Organism:
Homo sapiens (Human)
Description:
P48039
Residue:
350
  
Inhibitor
Name:
BDBM50425200
Synonyms:
CHEMBL2314253
Type:
Small organic molecule
Emp. Form.:
C17H19NO3
Mol. Mass.:
285.3377
SMILES:
COc1ccc2ccc(OC)c([C@@H]3C[C@H]3NC(C)=O)c2c1
: