Target
Mineralocorticoid receptor
Ligand
BDBM50398064
Substrate
Meas. Tech.
ChEMBL_935458 (CHEMBL2319267)
IC50
18±n/a nM
Citation
 Insuasty, BBecerra, DQuiroga, JAbonia, RNogueras, MCobo, J Microwave-assisted synthesis of pyrimido[4,5-b][1,6]naphthyridin-4(3H)-ones with potential antitumor activity. Eur J Med Chem 60:1-9 (2013)  
Target
Name:
Mineralocorticoid receptor
Synonyms:
MCR MLR NR3C2 | Nuclear receptor subfamily 3 group C member 2
Type:
Enzyme
Mol. Mass.:
107076.42
Organism:
Homo sapiens (Human)
Description:
P08235
Residue:
984
  
Inhibitor
Name:
BDBM50398064
Synonyms:
CHEMBL2181927
Type:
Small organic molecule
Emp. Form.:
C21H22N4O3
Mol. Mass.:
378.4244
SMILES:
CCOc1ncc(C)c2N=C(C)C([C@@H](c3ccc(cc3OC)C#N)c12)C(N)=O
: