Target
NAD-dependent protein deacetylase sirtuin-1
Ligand
BDBM50425978
Substrate
Meas. Tech.
ChEMBL_934585 (CHEMBL2317546)
IC50
146000±n/a nM
Citation
 Wu, JLi, YChen, KJiang, HXu, MHLiu, D Identification of benzofuran-3-yl(phenyl)methanones as novel SIRT1 inhibitors: binding mode, inhibitory mechanism and biological action. Eur J Med Chem 60:441-50 (2013)  
Target
Name:
NAD-dependent protein deacetylase sirtuin-1
Synonyms:
NAD-Dependent Deacetylase Sirtuin-1 NAD-dependent protein deacetylase sirtuin-1 (SIRT1) SIR2-like protein 1 SIRT1 Sirtuin-1 (SIRT1) | hSIR2
Type:
Developmental protein; hydrolase
Mol. Mass.:
81626.66
Organism:
Homo sapiens (Human)
Description:
Residue:
747
  
Inhibitor
Name:
BDBM50425978
Synonyms:
CHEMBL2314707
Type:
Small organic molecule
Emp. Form.:
C19H11BrO3
Mol. Mass.:
367.193
SMILES:
Oc1cc2c(coc2c2ccccc12)C(=O)c1ccc(Br)cc1
: