Target
Macrophage metalloelastase
Ligand
BDBM50426080
Substrate
Meas. Tech.
ChEMBL_935216 (CHEMBL2317585)
Ki
0.280000±n/a nM
Citation
 Czarny, BStura, EADevel, LVera, LCassar-Lajeunesse, EBeau, FCalderone, VFragai, MLuchinat, CDive, V Molecular determinants of a selective matrix metalloprotease-12 inhibitor: insights from crystallography and thermodynamic studies. J Med Chem 56:1149-59 (2013)  
Target
Name:
Macrophage metalloelastase
Synonyms:
HME MMP12_HUMAN Matrix metalloproteinase-12 (MMP 12) Matrix metalloproteinase-12 (MMP12) | Matrix metalloproteinases 12 (MMP-12)
Type:
Enzyme
Mol. Mass.:
54012.99
Organism:
Homo sapiens (Human)
Description:
P39900
Residue:
470
  
Inhibitor
Name:
BDBM50426080
Synonyms:
CHEMBL2316257
Type:
Small organic molecule
Emp. Form.:
C31H31BrClN4O6P
Mol. Mass.:
701.932
SMILES:
C[C@H](NC(=O)[C@H](C)NC(=O)[C@H](Cc1cc(no1)-c1ccc(cc1)-c1cccc(Cl)c1)CP(O)(=O)c1ccc(Br)cc1)C(N)=O
: