Target
Sphingosine kinase 1
Ligand
BDBM50426176
Substrate
Meas. Tech.
ChEMBL_935830 (CHEMBL2317616)
IC50
>1000±n/a nM
Citation
 Nacht, MQiao, LSheets, MPSt Martin, TLabenski, MMazdiyasni, HKarp, RZhu, ZChaturvedi, PBhavsar, DNiu, DWestlin, WPetter, RCMedikonda, APSingh, J Discovery of a potent and isoform-selective targeted covalent inhibitor of the lipid kinase PI3Ka. J Med Chem 56:712-21 (2013)  
Target
Name:
Sphingosine kinase 1
Synonyms:
SK1 SPHK1 SPK Sphingosine kinase 1 (SPHK1) | Sphingosine kinase types 1 (SphK1)
Type:
Enzyme
Mol. Mass.:
42521.16
Organism:
Homo sapiens (Human)
Description:
Q9NYA1
Residue:
384
  
Inhibitor
Name:
BDBM50426176
Synonyms:
CHEMBL2316958
Type:
Small organic molecule
Emp. Form.:
C30H35N7O3S
Mol. Mass.:
573.709
SMILES:
CC(C)=CC(=O)CCC(=O)N1CCN(Cc2cc3nc(nc(N4CCOCC4)c3s2)-c2cccc3[nH]ncc23)CC1
: