Target
Phosphatidylinositol 4-kinase alpha
Ligand
BDBM50426176
Substrate
Meas. Tech.
ChEMBL_935831 (CHEMBL2317617)
IC50
>1000±n/a nM
Citation
 Nacht, MQiao, LSheets, MPSt Martin, TLabenski, MMazdiyasni, HKarp, RZhu, ZChaturvedi, PBhavsar, DNiu, DWestlin, WPetter, RCMedikonda, APSingh, J Discovery of a potent and isoform-selective targeted covalent inhibitor of the lipid kinase PI3Ka. J Med Chem 56:712-21 (2013)  
Target
Name:
Phosphatidylinositol 4-kinase alpha
Synonyms:
PI4-kinase alpha PI4K-alpha PI4KA/PI4KAP2 PIK4 PIK4CA Phosphatidylinositol 4-kinase alpha (PI4KA) | PtdIns-4-kinase alpha
Type:
Protein
Mol. Mass.:
231326.70
Organism:
Homo sapiens (Human)
Description:
P42356
Residue:
2102
  
Inhibitor
Name:
BDBM50426176
Synonyms:
CHEMBL2316958
Type:
Small organic molecule
Emp. Form.:
C30H35N7O3S
Mol. Mass.:
573.709
SMILES:
CC(C)=CC(=O)CCC(=O)N1CCN(Cc2cc3nc(nc(N4CCOCC4)c3s2)-c2cccc3[nH]ncc23)CC1
: