Target
Phosphatidylinositol 4,5-bisphosphate 3-kinase catalytic subunit gamma isoform
Ligand
BDBM50426176
Substrate
Meas. Tech.
ChEMBL_935836 (CHEMBL2317622)
IC50
240±n/a nM
Citation
 Nacht, MQiao, LSheets, MPSt Martin, TLabenski, MMazdiyasni, HKarp, RZhu, ZChaturvedi, PBhavsar, DNiu, DWestlin, WPetter, RCMedikonda, APSingh, J Discovery of a potent and isoform-selective targeted covalent inhibitor of the lipid kinase PI3Ka. J Med Chem 56:712-21 (2013)  
Target
Name:
Phosphatidylinositol 4,5-bisphosphate 3-kinase catalytic subunit gamma isoform
Synonyms:
PI3-kinase p110 subunit gamma PI3Kgamma PK3CG_HUMAN Phosphatidylinositol 4,5-bisphosphate 3-kinase (PI3K) Phosphatidylinositol 4,5-bisphosphate 3-kinase catalytic subunit gamma (PI3Kgamma) Phosphatidylinositol 4,5-bisphosphate 3-kinase catalytic subunit gamma isoform (PI3K) Phosphatidylinositol-4,5-bisphosphate 3-kinase catalytic subunit gamma isoform Phosphoinositide 3-kinases gamma (PI3K gamma) p120-PI3K
Type:
Enzyme Subunit
Mol. Mass.:
126470.30
Organism:
Homo sapiens (Human)
Description:
P48736
Residue:
1102
  
Inhibitor
Name:
BDBM50426176
Synonyms:
CHEMBL2316958
Type:
Small organic molecule
Emp. Form.:
C30H35N7O3S
Mol. Mass.:
573.709
SMILES:
CC(C)=CC(=O)CCC(=O)N1CCN(Cc2cc3nc(nc(N4CCOCC4)c3s2)-c2cccc3[nH]ncc23)CC1
: