Target
Threonine--tRNA ligase 1, cytoplasmic
Ligand
BDBM50426200
Substrate
Meas. Tech.
ChEMBL_935846 (CHEMBL2317882)
Ki
13±n/a nM
Citation
 Teng, MHilgers, MTCunningham, MLBorchardt, ALocke, JBAbraham, SHaley, GKwan, BPHall, CHough, GWShaw, KJFinn, J Identification of bacteria-selective threonyl-tRNA synthetase substrate inhibitors by structure-based design. J Med Chem 56:1748-60 (2013)  
Target
Name:
Threonine--tRNA ligase 1, cytoplasmic
Synonyms:
SYTC_HUMAN TARS1 | Threonyl-tRNA synthetase
Type:
PROTEIN
Mol. Mass.:
83435.65
Organism:
Homo sapiens (Human)
Description:
ChEMBL_935846
Residue:
723
  
Inhibitor
Name:
BDBM50426200
Synonyms:
CHEMBL2311917
Type:
Small organic molecule
Emp. Form.:
C14H21N7O8S
Mol. Mass.:
447.424
SMILES:
C[C@@H](O)[C@H](N)C(=O)NS(=O)(=O)OC[C@@H]1O[C@@H]([C@@H](O)[C@H]1O)n1cnc2c(N)ncnc12
: