Target
Threonine--tRNA ligase
Ligand
BDBM50426198
Substrate
Meas. Tech.
ChEMBL_935847 (CHEMBL2317883)
Ki
436±n/a nM
Citation
 Teng, MHilgers, MTCunningham, MLBorchardt, ALocke, JBAbraham, SHaley, GKwan, BPHall, CHough, GWShaw, KJFinn, J Identification of bacteria-selective threonyl-tRNA synthetase substrate inhibitors by structure-based design. J Med Chem 56:1748-60 (2013)  
Target
Name:
Threonine--tRNA ligase
Synonyms:
SYT_YERPE YP_2221 y1903
Type:
PROTEIN
Mol. Mass.:
73649.43
Organism:
Yersinia pestis
Description:
ChEMBL_935847
Residue:
642
  
Inhibitor
Name:
BDBM50426198
Synonyms:
CHEMBL2316962
Type:
Small organic molecule
Emp. Form.:
C19H20ClN5O2
Mol. Mass.:
385.847
SMILES:
C[C@@H](O)[C@H](N)C(=O)NCc1cccc(c1)-c1ccc2c(N)nc(Cl)nc2c1
: