Target
Threonine--tRNA ligase
Ligand
BDBM50426199
Substrate
Meas. Tech.
ChEMBL_935847 (CHEMBL2317883)
Ki
33100±n/a nM
Citation
 Teng, MHilgers, MTCunningham, MLBorchardt, ALocke, JBAbraham, SHaley, GKwan, BPHall, CHough, GWShaw, KJFinn, J Identification of bacteria-selective threonyl-tRNA synthetase substrate inhibitors by structure-based design. J Med Chem 56:1748-60 (2013)  
Target
Name:
Threonine--tRNA ligase
Synonyms:
SYT_YERPE YP_2221 y1903
Type:
PROTEIN
Mol. Mass.:
73649.43
Organism:
Yersinia pestis
Description:
ChEMBL_935847
Residue:
642
  
Inhibitor
Name:
BDBM50426199
Synonyms:
CHEMBL2316959
Type:
Small organic molecule
Emp. Form.:
C16H18N2O5S
Mol. Mass.:
350.39
SMILES:
C[C@@H](O)[C@H](N)C(=O)NS(=O)(=O)c1ccc(Oc2ccccc2)cc1
: