Target
Sodium-dependent noradrenaline transporter
Ligand
BDBM50426346
Substrate
Meas. Tech.
ChEMBL_939924 (CHEMBL2327306)
Ki
170±n/a nM
Citation
 Brown, DGBernstein, PRWu, YUrbanek, RABecker, CWThroner, SRDembofsky, BTSteelman, GBLazor, LAScott, CWWood, MWWesolowski, SSNugiel, DAKoch, SYu, JPivonka, DELi, SThompson, CZacco, AElmore, CSSchroeder, PLiu, JHurley, CAWard, SHunt, HJWilliams, KMcLaughlin, JHoesch, VSydserff, SMaier, DAharony, D Azepines and piperidines with dual norepinephrine dopamine uptake inhibition and antidepressant activity. ACS Med Chem Lett 4:46-51 (2013)  
Target
Name:
Sodium-dependent noradrenaline transporter
Synonyms:
Monoamine transporter NET Noradrenaline Transporter (NET) Norepinephrine transporter protein (NET) SLC6A2 Sodium-dependent noradrenaline transporter (NET) | Solute carrier family 6 member 2
Type:
Multi-pass membrane protein
Mol. Mass.:
69337.72
Organism:
Homo sapiens (Human)
Description:
P23975
Residue:
617
  
Inhibitor
Name:
BDBM50426346
Synonyms:
CHEMBL2326685
Type:
Small organic molecule
Emp. Form.:
C13H16ClN
Mol. Mass.:
221.726
SMILES:
Cc1cc(ccc1Cl)C1CNCC=CC1
: