Target
Fatty-acid amide hydrolase 1
Ligand
BDBM50426683
Substrate
Meas. Tech.
ChEMBL_939830 (CHEMBL2329423)
Ki
13±n/a nM
Citation
 Butini, SGemma, SBrindisi, MMaramai, SMinetti, PCelona, DNapolitano, RBorsini, FCabri, WFezza, FMerlini, LDallavalle, SCampiani, GMaccarrone, M Identification of a novel arylpiperazine scaffold for fatty acid amide hydrolase inhibition with improved drug disposition properties. Bioorg Med Chem Lett 23:492-5 (2012)  
Target
Name:
Fatty-acid amide hydrolase 1
Synonyms:
Anandamide amidohydrolase FAAH1_MOUSE Faah1 Fatty-acid amide hydrolase (FAAH) Oleamide hydrolase 1
Type:
Hydrolase; single-pass membrane protein; homodimer
Mol. Mass.:
63227.28
Organism:
Mus musculus (mouse)
Description:
Mouse brain membranes were used in the assay.
Residue:
579
  
Inhibitor
Name:
BDBM50426683
Synonyms:
CHEMBL2326500
Type:
Small organic molecule
Emp. Form.:
C23H31N3O2
Mol. Mass.:
381.5111
SMILES:
O=C(NCCCCCCc1ccccc1)Oc1cccc(c1)N1CCNCC1
: