Target
Peroxisome proliferator-activated receptor gamma
Ligand
BDBM50426774
Substrate
Meas. Tech.
ChEMBL_940611 (CHEMBL2327553)
EC50
292±n/a nM
Citation
 Casimiro-Garcia, AHeemstra, RJBigge, CFChen, JCiske, FADavis, JAEllis, TEsmaeil, NFlynn, DHan, SJalaie, MOhren, JFPowell, NA Design, synthesis, and evaluation of imidazo[4,5-c]pyridin-4-one derivatives with dual activity at angiotensin II type 1 receptor and peroxisome proliferator-activated receptor-¿. Bioorg Med Chem Lett 23:767-72 (2013)  
Target
Name:
Peroxisome proliferator-activated receptor gamma
Synonyms:
NR1C3 PPAR-gamma PPARG_HUMAN Peroxisome proliferator-activated receptor gamma (PPAR gamma) Peroxisome proliferator-activated receptor gamma (PPARĪ³) peroxisome proliferator-activated receptor gamma isoform 2
Type:
Nuclear Receptor
Mol. Mass.:
57613.46
Organism:
Homo sapiens (Human)
Description:
P37231
Residue:
505
  
Inhibitor
Name:
BDBM50426774
Synonyms:
CHEMBL2322437
Type:
Small organic molecule
Emp. Form.:
C31H27N7O
Mol. Mass.:
513.5924
SMILES:
CCc1nc2ccn(Cc3ccccc3)c(=O)c2n1[C@H]1CCc2cc(ccc12)-c1ccccc1-c1nnn[nH]1
: