Target
Thymidylate synthase
Ligand
BDBM50426852
Substrate
Meas. Tech.
ChEMBL_938335 (CHEMBL2329009)
Ki
4200±n/a nM
Citation
 Ferrari, SIngrami, MSoragni, FWade, RCCosti, MP Ligand-based discovery of N-(1,3-dioxo-1H,3H-benzo[de]isochromen-5-yl)-carboxamide and sulfonamide derivatives as thymidylate synthase A inhibitors. Bioorg Med Chem Lett 23:663-8 (2013)  
Target
Name:
Thymidylate synthase
Synonyms:
TS TYMS Thymidylate synthase (TS) | Thymidylate synthase/GAR transformylase/AICAR transformylase
Type:
Enzyme
Mol. Mass.:
35718.07
Organism:
Homo sapiens (Human)
Description:
Residue:
313
  
Inhibitor
Name:
BDBM50426852
Synonyms:
CHEMBL2323363
Type:
Small organic molecule
Emp. Form.:
C11H6O2
Mol. Mass.:
170.1641
SMILES:
O=C1Oc2cccc3cccc1c23
: