Target
Carbonic anhydrase 2
Ligand
BDBM10887
Substrate
Meas. Tech.
ChEMBL_938522 (CHEMBL2327206)
Ki
10.0±n/a nM
Citation
 Pan, PVermelho, ABCapaci Rodrigues, GScozzafava, ATolvanen, MEParkkila, SCapasso, CSupuran, CT Cloning, characterization, and sulfonamide and thiol inhibition studies of ana-carbonic anhydrase from Trypanosoma cruzi, the causative agent of Chagas disease. J Med Chem 56:1761-71 (2013)  
Target
Name:
Carbonic anhydrase 2
Synonyms:
CA-II CAC Carbonate dehydratase II Carbonic anhydrase 2 (CA-II) Carbonic anhydrase C Carbonic anhydrase II (CA-II) Carbonic anhydrase II (hCA II) | Carbonic anhydrase isoenzyme II (hCA II)
Type:
Enzyme
Mol. Mass.:
29250.71
Organism:
Homo sapiens (Human)
Description:
P00918
Residue:
260
  
Inhibitor
Name:
BDBM10887
Synonyms:
Sulfamate 7 US11535599, Example topiramate | [(1R,2S,6S,9R)-4,4,11,11-tetramethyl-3,5,7,10,12-pentaoxatricyclo[7.3.0.0^{2,6}]dodecan-6-yl]methyl sulfamate
Type:
Small organic molecule
Emp. Form.:
C12H21NO8S
Mol. Mass.:
339.362
SMILES:
CC1(C)O[C@@H]2CO[C@@]3(COS(N)(=O)=O)OC(C)(C)O[C@H]3[C@@H]2O1
: