Target
Serine/threonine-protein kinase ATR
Ligand
BDBM50427297
Substrate
Meas. Tech.
ChEMBL_940941 (CHEMBL2330631)
IC50
440±n/a nM
Citation
 Foote, KMBlades, KCronin, AFillery, SGuichard, SSHassall, LHickson, IJacq, XJewsbury, PJMcGuire, TMNissink, JWOdedra, RPage, KPerkins, PSuleman, ATam, KThommes, PBroadhurst, RWood, C Discovery of 4-{4-[(3R)-3-Methylmorpholin-4-yl]-6-[1-(methylsulfonyl)cyclopropyl]pyrimidin-2-yl}-1H-indole (AZ20): a potent and selective inhibitor of ATR protein kinase with monotherapy in vivo antitumor activity. J Med Chem 56:2125-38 (2013)  
Target
Name:
Serine/threonine-protein kinase ATR
Synonyms:
ATR Ataxia telangiectasia and Rad3-related protein (ATR) FRP1 | Serine-protein kinase ATR
Type:
Protein
Mol. Mass.:
301404.58
Organism:
Homo sapiens (Human)
Description:
Q13535
Residue:
2644
  
Inhibitor
Name:
BDBM50427297
Synonyms:
CHEMBL2325439
Type:
Small organic molecule
Emp. Form.:
C20H21FN4O3S
Mol. Mass.:
416.469
SMILES:
CS(=O)(=O)C1(CC1)c1cc(nc(n1)-c1cc(F)cc2[nH]ccc12)N1CCOCC1
: