Target
Protein kinase C delta type
Ligand
BDBM50427386
Substrate
Meas. Tech.
ChEMBL_941118 (CHEMBL2330915)
Ki
336±n/a nM
Citation
 Jimenez, JMBoyall, DBrenchley, GCollier, PNDavis, CJFraysse, DKeily, SBHenderson, JMiller, APierard, FSettimo, LTwin, HCBolton, CMCurnock, APChiu, PTanner, AJYoung, S Design and optimization of selective protein kinase C¿ (PKC¿) inhibitors for the treatment of autoimmune diseases. J Med Chem 56:1799-810 (2013)  
Target
Name:
Protein kinase C delta type
Synonyms:
KPCD_HUMAN PKCD Protein Kinase C- delta nPKC-delta
Type:
Enzyme
Mol. Mass.:
77516.79
Organism:
Homo sapiens (Human)
Description:
The recombinant human PKC enzymes were produced using a baculovirus expression system in SF9 cells
Residue:
676
  
Inhibitor
Name:
BDBM50427386
Synonyms:
CHEMBL2321918
Type:
Small organic molecule
Emp. Form.:
C16H18N6
Mol. Mass.:
294.3543
SMILES:
C[C@@H]1CN(CCN1)c1cccc(n1)-c1n[nH]c2ncccc12
: