Target
Serine/threonine-protein kinase mTOR
Ligand
BDBM50428117
Substrate
Meas. Tech.
ChEMBL_944958 (CHEMBL2343997)
Ki
4.5±n/a nM
Citation
 Cheng, HLi, CBailey, SBaxi, SMGoulet, LGuo, LHoffman, JJiang, YJohnson, TOJohnson, TWKnighton, DRLi, JLiu, KKLiu, ZMarx, MAWalls, MWells, PAYin, MJZhu, JZientek, M Discovery of the Highly Potent PI3K/mTOR Dual Inhibitor PF-04979064 through Structure-Based Drug Design. ACS Med Chem Lett 4:91-7 (2013)  
Target
Name:
Serine/threonine-protein kinase mTOR
Synonyms:
FK506-binding protein 12-rapamycin complex-associated protein 1 FRAP FRAP1 MTOR Mammalian Target of Rapamycin (mTOR) RAFT1 Rapamycin and FKBP12 target 1 Serine/threonine-protein kinase (mTOR) | mTORC2
Type:
Rapamycin target protein
Mol. Mass.:
288917.12
Organism:
Homo sapiens (Human)
Description:
P42345
Residue:
2549
  
Inhibitor
Name:
BDBM50428117
Synonyms:
CHEMBL2331657
Type:
Small organic molecule
Emp. Form.:
C26H22N6O2
Mol. Mass.:
450.4919
SMILES:
COc1ccc(cn1)-c1ccc2ncc3n(C)c(=O)n(-c4ccc(cc4)C(C)(C)C#N)c3c2n1
: