Target
Cannabinoid receptor 2
Ligand
BDBM50428206
Substrate
Meas. Tech.
ChEMBL_946420 (CHEMBL2339600)
Ki
94±n/a nM
Citation
 Ouyang, QTong, QFeng, RMyint, KZYang, PXie, XQ Trisubstituted Sulfonamides: a New Chemotype for Development of Potent and Selective CB ACS Med Chem Lett 4:387-392 (2013)  
Target
Name:
Cannabinoid receptor 2
Synonyms:
CANNABINOID CB2 CB2 CB2B CNR2_HUMAN Cannabinoid CB2 receptor Cannabinoid receptor 2 (CB2R) | hCB2
Type:
G Protein-Coupled Receptor (GPCR)
Mol. Mass.:
39690.94
Organism:
Homo sapiens (Human)
Description:
P34972
Residue:
360
  
Inhibitor
Name:
BDBM50428206
Synonyms:
CHEMBL2336567
Type:
Small organic molecule
Emp. Form.:
C27H34N2O3S
Mol. Mass.:
466.635
SMILES:
CCN(CC)c1ccc(CN(Cc2ccccc2)S(=O)(=O)c2ccc(OC(C)C)cc2)cc1
: