Target
Gamma-aminobutyric acid receptor subunit rho-1
Ligand
BDBM50428276
Substrate
Meas. Tech.
ChEMBL_946446 (CHEMBL2339626)
IC50
58610±n/a nM
Citation
 Gavande, NKim, HLDoddareddy, MRJohnston, GAChebib, MHanrahan, JR Design, Synthesis, and Pharmacological Evaluation of Fluorescent and Biotinylated Antagonists of?1 GABAC Receptors. ACS Med Chem Lett 4:402-7 (2013)  
Target
Name:
Gamma-aminobutyric acid receptor subunit rho-1
Synonyms:
GABA receptor rho-1 subunit GABRR1 | GBRR1_HUMAN
Type:
PROTEIN
Mol. Mass.:
55892.34
Organism:
Homo sapiens (Human)
Description:
ChEMBL_1456653
Residue:
479
  
Inhibitor
Name:
BDBM50428276
Synonyms:
CHEMBL2337487
Type:
Small organic molecule
Emp. Form.:
C31H46BF2N4O4P
Mol. Mass.:
618.503
SMILES:
CCCCP(O)(=O)C1=C[C@H](CC1)NC(=O)CCCCCNC(=O)CCC1=C2C(C)=CC(C)=[N+]2[B-](F)(F)n2c(C)cc(C)c12
: