Target
Farnesyl pyrophosphate synthase
Ligand
BDBM50428294
Substrate
Meas. Tech.
ChEMBL_947369 (CHEMBL2344602)
IC50
120±n/a nM
Citation
 Zhang, YZhu, WLiu, YLWang, HWang, KLi, KNo, JHAyong, LGulati, APang, RFreitas-Junior, LMorita, CTOld-Field, E Chemo-Immunotherapeutic Anti-Malarials Targeting Isoprenoid Biosynthesis. ACS Med Chem Lett 4:423-427 (2013)  
Target
Name:
Farnesyl pyrophosphate synthase
Synonyms:
Dimethylallyltranstransferase FPP synthase FPPS_HUMAN Farnesyl diphosphate synthase Farnesyl diphosphate synthetase Farnesyl pyrophosphate synthetase KIAA1293 | P14324
Type:
Enzyme
Mol. Mass.:
48272.89
Organism:
Homo sapiens (Human)
Description:
P14324
Residue:
419
  
Inhibitor
Name:
BDBM50428294
Synonyms:
CHEMBL2338358
Type:
Small organic molecule
Emp. Form.:
C11H22N2O7P2
Mol. Mass.:
356.2491
SMILES:
CCCCCCn1cc[n+](CC(O)(P(O)(O)=O)P(O)([O-])=O)c1
: