Target
Carbonic anhydrase 2
Ligand
BDBM10861
Substrate
Meas. Tech.
ChEMBL_942133 (CHEMBL2341289)
Ki
160±n/a nM
Citation
 Demirdag, RÇomakli, VSentürk, MEkinci, DIrfan Küfrevioglu, ÖSupuran, CT Purification and characterization of carbonic anhydrase from sheep kidney and effects of sulfonamides on enzyme activity. Bioorg Med Chem 21:1522-5 (2013)  
Target
Name:
Carbonic anhydrase 2
Synonyms:
CA-II CAC Carbonate dehydratase II Carbonic anhydrase 2 (CA-II) Carbonic anhydrase C Carbonic anhydrase II (CA-II) Carbonic anhydrase II (hCA II) | Carbonic anhydrase isoenzyme II (hCA II)
Type:
Enzyme
Mol. Mass.:
29250.71
Organism:
Homo sapiens (Human)
Description:
P00918
Residue:
260
  
Inhibitor
Name:
BDBM10861
Synonyms:
4-(2-aminoethyl)benzene-1-sulfonamide aromatic sulfonamide compound 7 | aromatic/heteroaromatic sulfonamide 6
Type:
Small organic molecule
Emp. Form.:
C8H12N2O2S
Mol. Mass.:
200.258
SMILES:
NCCc1ccc(cc1)S(N)(=O)=O
: