Target
Prostaglandin G/H synthase 1
Ligand
BDBM50429290
Substrate
Meas. Tech.
ChEMBL_947093 (CHEMBL2340598)
IC50
>50000±n/a nM
Citation
 Yao, RSLu, XQGuan, QXZheng, LLu, XRuan, BF Synthesis and biological evaluation of some novel resveratrol amide derivatives as potential anti-tumor agents. Eur J Med Chem 62:222-31 (2013)  
Target
Name:
Prostaglandin G/H synthase 1
Synonyms:
COX-1 Cyclooxygenase Cyclooxygenase-1 (COX-1) PTGS1 | Prostaglandin G/H synthase (cyclooxygenase)
Type:
Enzyme
Mol. Mass.:
68692.62
Organism:
Homo sapiens (Human)
Description:
P23219
Residue:
599
  
Inhibitor
Name:
BDBM50429290
Synonyms:
CHEMBL2334132
Type:
Small organic molecule
Emp. Form.:
C30H41NO4
Mol. Mass.:
479.6508
SMILES:
CCCCCN(CCCCC)C(=O)\C=C\c1c(OC)cc(OC)cc1\C=C\c1ccc(OC)cc1
: