Target
Prostaglandin G/H synthase 2
Ligand
BDBM50429290
Substrate
Meas. Tech.
ChEMBL_947090 (CHEMBL2340595)
IC50
16430±n/a nM
Citation
 Yao, RSLu, XQGuan, QXZheng, LLu, XRuan, BF Synthesis and biological evaluation of some novel resveratrol amide derivatives as potential anti-tumor agents. Eur J Med Chem 62:222-31 (2013)  
Target
Name:
Prostaglandin G/H synthase 2
Synonyms:
COX2 Cyclooxygenase 2 (COX-2) Cyclooxygenase-2 (COX-2 AA) Cyclooxygenase-2 (COX-2) PGH2_HUMAN PHS II Prostaglandin E synthase/G/H synthase 2 Prostaglandin-endoperoxide synthase 2
Type:
Enzyme
Mol. Mass.:
69003.89
Organism:
Homo sapiens (Human)
Description:
Recombinant Cox-2 provided by Cayman (Cayman Chemical Co.,Ann Arbor, MI).
Residue:
604
  
Inhibitor
Name:
BDBM50429290
Synonyms:
CHEMBL2334132
Type:
Small organic molecule
Emp. Form.:
C30H41NO4
Mol. Mass.:
479.6508
SMILES:
CCCCCN(CCCCC)C(=O)\C=C\c1c(OC)cc(OC)cc1\C=C\c1ccc(OC)cc1
: