Target
Prostaglandin G/H synthase 2
Ligand
BDBM50429290
Substrate
Meas. Tech.
ChEMBL_947089 (CHEMBL2340594)
IC50
7190±n/a nM
Citation
 Yao, RSLu, XQGuan, QXZheng, LLu, XRuan, BF Synthesis and biological evaluation of some novel resveratrol amide derivatives as potential anti-tumor agents. Eur J Med Chem 62:222-31 (2013)  
Target
Name:
Prostaglandin G/H synthase 2
Synonyms:
Cox-2 Cyclooxygenase-2 Glucocorticoid-regulated inflammatory cyclooxygenase Macrophage activation-associated marker protein P71/73 PGH synthase 2 PGHS-2 Pghs-b Prostaglandin H2 synthase 2 Ptgs2 Tis10
Type:
Protein
Mol. Mass.:
69020.39
Organism:
Mus musculus (Mouse)
Description:
Q05769
Residue:
604
  
Inhibitor
Name:
BDBM50429290
Synonyms:
CHEMBL2334132
Type:
Small organic molecule
Emp. Form.:
C30H41NO4
Mol. Mass.:
479.6508
SMILES:
CCCCCN(CCCCC)C(=O)\C=C\c1c(OC)cc(OC)cc1\C=C\c1ccc(OC)cc1
: