Target
Palmitoyl-protein thioesterase 1
Ligand
BDBM50429510
Substrate
Meas. Tech.
ChEMBL_943689 (CHEMBL2344833)
IC50
10000±n/a nM
Citation
 Boyd, RELee, GRybczynski, PBenjamin, ERKhanna, RWustman, BAValenzano, KJ Pharmacological chaperones as therapeutics for lysosomal storage diseases. J Med Chem 56:2705-25 (2013)  
Target
Name:
Palmitoyl-protein thioesterase 1
Synonyms:
CLN1 PPT-1 PPT1_HUMAN | Palmitoyl-protein hydrolase 1
Type:
PROTEIN
Mol. Mass.:
34193.12
Organism:
Homo sapiens (Human)
Description:
ChEMBL_943688
Residue:
306
  
Inhibitor
Name:
BDBM50429510
Synonyms:
CHEMBL2332875
Type:
Small organic molecule
Emp. Form.:
C52H99N11O10
Mol. Mass.:
1038.4102
SMILES:
CCCCCCCCCCCCCCCC(=O)NC[C@H](NC(=O)CNC(C)=O)C(=O)N[C@@H](C(C)C)C(=O)N[C@@H](CCCCN)C(=O)N[C@@H]([C@@H](C)CC)C(=O)N[C@@H](CCCCN)C(=O)N[C@@H](CCCCN)C(O)=O
: