Target
Dihydrofolate reductase
Ligand
BDBM50429693
Substrate
Meas. Tech.
ChEMBL_947629 (CHEMBL2340616)
IC50
260±n/a nM
Citation
 Paulsen, JLViswanathan, KWright, DLAnderson, AC Structural analysis of the active sites of dihydrofolate reductase from two species of Candida uncovers ligand-induced conformational changes shared among species. Bioorg Med Chem Lett 23:1279-84 (2013)  
Target
Name:
Dihydrofolate reductase
Synonyms:
DHFR Dihydrofolate reductase (DHFR) | Tetrahydrofolate dehydrogenase
Type:
Enzyme
Mol. Mass.:
21453.99
Organism:
Homo sapiens (Human)
Description:
Recombinant human DHFR.
Residue:
187
  
Inhibitor
Name:
BDBM50429693
Synonyms:
CHEMBL2335423
Type:
Small organic molecule
Emp. Form.:
C25H26N4O3
Mol. Mass.:
430.4989
SMILES:
CCc1nc(N)nc(N)c1C#CC(C)c1cc(OC)cc(c1)-c1ccc2OCCOc2c1
: