Target
Dihydrofolate reductase
Ligand
BDBM50429696
Substrate
Meas. Tech.
ChEMBL_947629 (CHEMBL2340616)
IC50
60±n/a nM
Citation
 Paulsen, JLViswanathan, KWright, DLAnderson, AC Structural analysis of the active sites of dihydrofolate reductase from two species of Candida uncovers ligand-induced conformational changes shared among species. Bioorg Med Chem Lett 23:1279-84 (2013)  
Target
Name:
Dihydrofolate reductase
Synonyms:
DHFR Dihydrofolate reductase (DHFR) | Tetrahydrofolate dehydrogenase
Type:
Enzyme
Mol. Mass.:
21453.99
Organism:
Homo sapiens (Human)
Description:
Recombinant human DHFR.
Residue:
187
  
Inhibitor
Name:
BDBM50429696
Synonyms:
CHEMBL2335420
Type:
Small organic molecule
Emp. Form.:
C25H23N5O
Mol. Mass.:
409.483
SMILES:
CCc1nc(N)nc(N)c1C#CCc1cc(OC)cc(c1)-c1cccc2cnccc12
: