Target
Dihydrofolate reductase
Ligand
BDBM50298800
Substrate
Meas. Tech.
ChEMBL_947629 (CHEMBL2340616)
IC50
1410±n/a nM
Citation
 Paulsen, JLViswanathan, KWright, DLAnderson, AC Structural analysis of the active sites of dihydrofolate reductase from two species of Candida uncovers ligand-induced conformational changes shared among species. Bioorg Med Chem Lett 23:1279-84 (2013)  
Target
Name:
Dihydrofolate reductase
Synonyms:
DHFR Dihydrofolate reductase (DHFR) | Tetrahydrofolate dehydrogenase
Type:
Enzyme
Mol. Mass.:
21453.99
Organism:
Homo sapiens (Human)
Description:
Recombinant human DHFR.
Residue:
187
  
Inhibitor
Name:
BDBM50298800
Synonyms:
(+/-)-5-(3-(5-methoxy-4'-methylbiphenyl-3-yl)but-1-ynyl)-6-methylpyrimidine-2,4-diamine CHEMBL584391 | US8853228, 141
Type:
Small organic molecule
Emp. Form.:
C23H24N4O
Mol. Mass.:
372.4629
SMILES:
COc1cc(cc(c1)-c1ccc(C)cc1)C(C)C#Cc1c(C)nc(N)nc1N
: